{"text_format":"1","workbook":"xlsx","n_sheets":13,"sheets":["Introduction","Identify potential options","Option feasibility assessment","Multi-criteria assessment","Targeted indicators","MCA criteria weighting","Scoring","MCA indicator weighting","Results","Analysis","Sensitivity","Sensitivity Calc","General Calc"],"not_rendered":{"charts":0,"images":1,"macros":1,"external_links":1,"defined_names":2,"comments":7,"pivot_tables":0},"unopened":[],"bounds":{"document_bytes":16777216,"sheet_cells":100000,"rows_first":2000,"rows_last":500,"rows_between":2000,"halvings":0,"cell_chars":16384,"cell_head_chars":4096},"cells_cut":0,"cells_raw":0,"read":"whole","date_system":"1900"}

{"sheet":"Introduction","index":0,"n_rows":8,"n_cols":2,"rows_kept":8,"cut":false,"hidden":false,"merged":[[7,1,7,10],[2,1,4,8],[1,1,1,8]]}
[]
[null,"State guideline: Flood evacuation route improvements - Supporting tool"]
[null,"This tool supports Stage one: option feasibility assessment and Stage two: multi-criteria assessment of the State guideline: Flood evacuation route improvements (the guideline). The tool is not intended to be used independently to assess flood evacuation route improvements and is to be used in conjunction with the assessment process in the guideline. \n\nDisclaimer\nThis Support Tool is provided to assist users in undertaking the options assessment process outlined in the State guideline: Flood evacuation route improvements (guideline).  The guideline is intended to support users in identifying ‘fair and reasonable’ improvements to flood evacuation routes and improving evacuation.  Neither the process nor information in this Support Tool is intended to be exhaustive.  Neither TMR nor QRA make any representations or warranties about the accuracy, reliability, completeness or suitability for any particular purpose of the process or information contained in the guideline or this Support Tool.  Neither TMR nor QRA will be liable for any loss or damage suffered by users, caused by any error, inaccuracy, incompleteness or other similar defect in this Support Tool or in reliance of any of its contents.\n\nUse of this Support Tool or compliance with the guideline is not evidence that TMR or QRA will endorse any development, contribute to any development, commit to its own development or grant, or consider granting, funding in any capacity to any user of this guideline or other entity.\n"]
[]
[]
[]
{"$rows_left_out":3}
{"sheet":"Identify potential options","index":1,"n_rows":26,"n_cols":3,"rows_kept":26,"cut":false,"hidden":false,"merged":[[2,1,2,2],[1,1,1,2]]}
[]
[null,"Identify potential options"]
[null,"Enter the long list of potential options for assessment in the table below. "]
[]
[]
[null,null,"Name"]
{"$rows_left_out":21}
{"sheet":"Option feasibility assessment","index":2,"n_rows":26,"n_cols":23,"rows_kept":26,"cut":false,"hidden":false,"merged":[[4,8,5,8],[4,9,5,9],[4,1,5,1],[1,1,1,5],[4,7,5,7],[4,2,4,6]]}
[]
[null,"Stage one: option feasibility assessment\nFor each option select the response to the feasibility indicators and the high level cost estimate, before selecting the outcome. \n\nWhere 'Redefine option' is selected as the outcome, return to the Identify Potential Options worksheet to redefine the option. Following re-assessment complete this worksheet for the redefined option. \n\nWhere 'Collect further information required' is selected as the outcome, collect further information to re-assess the option. Following this, complete this worksheet with the additional information. "]
[]
[null,null,null,null,null,null,null,null,null,null,null,null,null,null,null,null,null,null,null,"Yes/No","Lookup","Unique Category","Category Lookup"]
[null,"Options","Feasibility Indicators",null,null,null,null,"High level cost estimate","Outcome","Action"]
[null,null,"The option is likely to reduce risk to life for the affected population","The option is unlikely to cause significant environmental or cultural heritage impacts that are unable to be mitigated","The community supports the option and is likely to respond","The option is unlikely to cause adverse significant flood impacts that cannot be mitigated ","The option is physically and technically feasible when considering engineering, constructability or legal constraints",null,null,null,null,"Scoring","Indicator met","More information","Indicator not met",null,null,null,null,null,{"$f":"SUM(V7:V37)","v":0}]
{"$rows_left_out":21}
{"sheet":"Multi-criteria assessment","index":3,"n_rows":26,"n_cols":5,"rows_kept":26,"cut":false,"hidden":false,"merged":[[1,3,1,5]]}
[]
[null,null,null,"Stage two: multi-criteria assessment\nShort listed options for assessment in the stage two: multi-criteria assessment are shown in the table below. "]
[]
[]
[]
[{"$f":"MAX('Option feasibility assessment'!$T:$T)","v":0},null,null,null,"Name"]
{"$rows_left_out":21}
{"sheet":"Targeted indicators","index":4,"n_rows":21,"n_cols":18,"rows_kept":21,"cut":false,"hidden":false,"merged":[[5,5,5,9],[1,1,1,5],[5,1,7,1],[5,2,7,2],[6,5,7,5],[6,6,7,6],[6,7,7,7],[6,8,7,8],[6,9,7,9]]}
[]
[null,"Targeted indicators\nShort-listed options will be assessed against the targeted indicators for each criteria shown in the table below. \n\nWhere a targeted indicator is not applicable for all options under assessment, ensure the assigned scores for the indicator are the same for all options. For example, if all options being assessed are non-infrastructure options. Assign a score of five to all options for the targeted indicator under flood behaviour/impacts criterion. \n\n"]
[]
[]
[]
[null,"Criteria","Targeted indicator","Use?","Measure","Scoring descriptors"]
{"$rows_left_out":16}
{"sheet":"MCA criteria weighting","index":5,"n_rows":37,"n_cols":14,"rows_kept":37,"cut":false,"hidden":false,"merged":[[1,3,1,6]]}
[]
[null,null,null,"Multi-criteria Assessment criteria weighting (pairwise method)\nThis tool applies the pairwise method to determine weightings. To determine criteria weightings, complete the pairwise matrix below. If applying no weighting ensure a nil response is provided in all the input fields.  \n"]
[]
[]
[null,null,null,"  ",null,"Safety","Economic","Environmental and cultural heritage impact","Social","Flood behaviour/impact","Additional constraints","Occurrence +1","WEIGHTING"]
[null,null,null,"  ",null,{"$f":"IF(F5=\"\",\"\",INDEX('General Calc'!$B$5:$B$24,COLUMNS($F$5:F$5)))","v":"A"},{"$f":"IF(G5=\"\",\"\",INDEX('General Calc'!$B$5:$B$24,COLUMNS($F$5:G$5)))","v":"B"},{"$f":"IF(H5=\"\",\"\",INDEX('General Calc'!$B$5:$B$24,COLUMNS($F$5:H$5)))","v":"C"},{"$f":"IF(I5=\"\",\"\",INDEX('General Calc'!$B$5:$B$24,COLUMNS($F$5:I$5)))","v":"D"},{"$f":"IF(J5=\"\",\"\",INDEX('General Calc'!$B$5:$B$24,COLUMNS($F$5:J$5)))","v":"E"},{"$f":"IF(K5=\"\",\"\",INDEX('General Calc'!$B$5:$B$24,COLUMNS($F$5:K$5)))","v":"F"}]
{"$rows_left_out":32}
{"sheet":"Scoring","index":6,"n_rows":31,"n_cols":25,"rows_kept":31,"cut":false,"hidden":false,"merged":[]}
[]
[null,"Scoring\nEnter scores of between 1 to 5 for each of the targeted indicators. Score descriptors can be found in the Targeted indicators worksheet. \n\nEnsure scores have been assigned for each targeted indicator and option being assessed. Errors will occur in calculating scores, if a score has not been assigned. \n\nNote, after inputting scores, if there are changes to the options feasibility assessment resulting in the removal or addition of options scores will need to be re-entered to avoid errors in calculating scores. "]
[null,null,null,null,null,{"$f":"TRANSPOSE('Multi-criteria assessment'!$E$7:$E$26)","v":""},"","","","","","","","","","","","","","","","","","",""]
[null,"Criteria","Targeted Indicator","Pairwise Comparison","Base Case",{"$f":"IF(F3=0,\"\",F3)","v":""},{"$f":"IF(G3=0,\"\",G3)","v":""},"","","","","","","","","","","","","","","","","",""]
[null,{"$f":"'Targeted indicators'!B9","v":"Safety"},{"$f":"'Targeted indicators'!C9","v":"Ability to evacuate to safer locations or evacuation centres"},{"$f":"IF(B5=\"\",\"\",VLOOKUP(B5,'MCA criteria weighting'!$D$7:$M$36,10,FALSE))","v":0.16666666666666666},3]
[null,{"$f":"'Targeted indicators'!B10","v":"Safety"},{"$f":"'Targeted indicators'!C10","v":"Population at risk"},{"$f":"IF(B6=\"\",\"\",VLOOKUP(B6,'MCA criteria weighting'!$D$7:$M$36,10,FALSE))","v":0.16666666666666666},3]
{"$rows_left_out":26}
{"sheet":"MCA indicator weighting","index":7,"n_rows":43,"n_cols":20,"rows_kept":43,"cut":false,"hidden":true,"merged":[[1,2,1,7]]}
[]
[null,null,"**DO NOT EDIT**\n"]
[]
[]
[null,null,null,"  ",null,{"$f":"IF(ROWS($D$7:$D7)>'Targeted indicators'!$N$8,\"\",INDEX('Targeted indicators'!$B:$B,MATCH(ROWS($D$7:$D7),'Targeted indicators'!$O:$O,0)))","v":"Safety"},{"$f":"IF(ROWS($D$7:$D8)>'Targeted indicators'!$N$8,\"\",INDEX('Targeted indicators'!$B:$B,MATCH(ROWS($D$7:$D8),'Targeted indicators'!$O:$O,0)))","v":"Economic"},{"$f":"IF(ROWS($D$7:$D9)>'Targeted indicators'!$N$8,\"\",INDEX('Targeted indicators'!$B:$B,MATCH(ROWS($D$7:$D9),'Targeted indicators'!$O:$O,0)))","v":"Environmental and cultural heritage impact"},{"$f":"IF(ROWS($D$7:$D10)>'Targeted indicators'!$N$8,\"\",INDEX('Targeted indicators'!$B:$B,MATCH(ROWS($D$7:$D10),'Targeted indicators'!$O:$O,0)))","v":"Social"},{"$f":"IF(ROWS($D$7:$D11)>'Targeted indicators'!$N$8,\"\",INDEX('Targeted indicators'!$B:$B,MATCH(ROWS($D$7:$D11),'Targeted indicators'!$O:$O,0)))","v":"Flood behaviour/impact"},{"$f":"IF(ROWS($D$7:$D12)>'Targeted indicators'!$N$8,\"\",INDEX('Targeted indicators'!$B:$B,MATCH(ROWS($D$7:$D12),'Targeted indicators'!$O:$O,0)))","v":"Additional constraints"},{"$f":"IF(ROWS($D$7:$D13)>'Targeted indicators'!$N$8,\"\",INDEX('Targeted indicators'!$B:$B,MATCH(ROWS($D$7:$D13),'Targeted indicators'!$O:$O,0)))","v":""},{"$f":"IF(ROWS($D$7:$D14)>'Targeted indicators'!$N$8,\"\",INDEX('Targeted indicators'!$B:$B,MATCH(ROWS($D$7:$D14),'Targeted indicators'!$O:$O,0)))","v":""},{"$f":"IF(ROWS($D$7:$D15)>'Targeted indicators'!$N$8,\"\",INDEX('Targeted indicators'!$B:$B,MATCH(ROWS($D$7:$D15),'Targeted indicators'!$O:$O,0)))","v":""},{"$f":"IF(ROWS($D$7:$D16)>'Targeted indicators'!$N$8,\"\",INDEX('Targeted indicators'!$B:$B,MATCH(ROWS($D$7:$D16),'Targeted indicators'!$O:$O,0)))","v":""},{"$f":"IF(ROWS($D$7:$D17)>'Targeted indicators'!$N$8,\"\",INDEX('Targeted indicators'!$B:$B,MATCH(ROWS($D$7:$D17),'Targeted indicators'!$O:$O,0)))","v":""},{"$f":"IF(ROWS($D$7:$D18)>'Targeted indicators'!$N$8,\"\",INDEX('Targeted indicators'!$B:$B,MATCH(ROWS($D$7:$D18),'Targeted indicators'!$O:$O,0)))","v":""},"Occurrence +1","WEIGHTING"]
[null,null,null,"  ",null,{"$f":"IF(F5=\"\",\"\",INDEX('General Calc'!$B$5:$B$24,COLUMNS($F$5:F$5)))","v":"A"},{"$f":"IF(G5=\"\",\"\",INDEX('General Calc'!$B$5:$B$24,COLUMNS($F$5:G$5)))","v":"B"},{"$f":"IF(H5=\"\",\"\",INDEX('General Calc'!$B$5:$B$24,COLUMNS($F$5:H$5)))","v":"C"},{"$f":"IF(I5=\"\",\"\",INDEX('General Calc'!$B$5:$B$24,COLUMNS($F$5:I$5)))","v":"D"},{"$f":"IF(J5=\"\",\"\",INDEX('General Calc'!$B$5:$B$24,COLUMNS($F$5:J$5)))","v":"E"},{"$f":"IF(K5=\"\",\"\",INDEX('General Calc'!$B$5:$B$24,COLUMNS($F$5:K$5)))","v":"F"},{"$f":"IF(L5=\"\",\"\",INDEX('General Calc'!$B$5:$B$24,COLUMNS($F$5:L$5)))","v":""},{"$f":"IF(M5=\"\",\"\",INDEX('General Calc'!$B$5:$B$24,COLUMNS($F$5:M$5)))","v":""},{"$f":"IF(N5=\"\",\"\",INDEX('General Calc'!$B$5:$B$24,COLUMNS($F$5:N$5)))","v":""},{"$f":"IF(O5=\"\",\"\",INDEX('General Calc'!$B$5:$B$24,COLUMNS($F$5:O$5)))","v":""},{"$f":"IF(P5=\"\",\"\",INDEX('General Calc'!$B$5:$B$24,COLUMNS($F$5:P$5)))","v":""},{"$f":"IF(Q5=\"\",\"\",INDEX('General Calc'!$B$5:$B$24,COLUMNS($F$5:Q$5)))","v":""}]
{"$rows_left_out":38}
{"sheet":"Results","index":8,"n_rows":56,"n_cols":22,"rows_kept":56,"cut":false,"hidden":false,"merged":[[43,1,44,1],[5,3,14,11],[4,1,4,2],[4,3,4,4],[4,5,4,6],[4,7,4,8],[4,9,4,10],[19,1,20,1],[19,2,19,7],[19,8,19,9]]}
[]
[]
[null,"\nResults\nThe results of the Stage two: multi-criteria assessment is shown in the table below. The table shows both results for each criteria and the overall results. Criteria results are the average scores for each criteria and do not apply the assigned weightings. The overall results take into account weightings and are determined by totalling the weighted scores for each targeted indicator. \n"]
[]
[null,"Highest scoring option"]
[null,"Overall",{"$f":"INDEX(Analysis!$G$4:$AB$4,MATCH(1,Results!$B$19:$Y$19,0))","v":{"$error":"#N/A"}},{"$f":"INDEX('Identify potential options'!$D$7:$D$26,MATCH(C6,'Identify potential options'!$C$7:$C$26,0))","v":{"$error":"#N/A"}}]
{"$rows_left_out":51}
{"sheet":"Analysis","index":9,"n_rows":31,"n_cols":27,"rows_kept":31,"cut":false,"hidden":false,"merged":[[1,1,1,2]]}
[]
[null,"Analysis\nAn analysis of the results is shown in the table below. The table displays the following:\n\nCriteria weighting - weightings determined through the pairwise method in the Multi-criteria Assessment Criteria Weighting Worksheet\n\nTargeted indicator weighting - determined by dividing criteria weighting by the number of targeted indicators within the criterion. \n\nWeighted scores - determined by multiplying scores by the    targeted indicator weightings\n\nOverall scores - sum of the weighted scores for each option."]
[]
[null,"Criteria","Criteria Weighting","Targeted indicator","Weighting of issue within criteria (%)","Targeted indicator weighting",{"$f":"Scoring!E4","v":"Base Case"},{"$f":"Scoring!F4","v":""},{"$f":"Scoring!G4","v":""},{"$f":"Scoring!H4","v":""},{"$f":"Scoring!I4","v":""},{"$f":"Scoring!J4","v":""},{"$f":"Scoring!K4","v":""},{"$f":"Scoring!L4","v":""},{"$f":"Scoring!M4","v":""},{"$f":"Scoring!N4","v":""},{"$f":"Scoring!O4","v":""},{"$f":"Scoring!P4","v":""},{"$f":"Scoring!Q4","v":""},{"$f":"Scoring!R4","v":""},{"$f":"Scoring!S4","v":""},{"$f":"Scoring!T4","v":""},{"$f":"Scoring!U4","v":""},{"$f":"Scoring!V4","v":""},{"$f":"Scoring!W4","v":""},{"$f":"Scoring!X4","v":""},{"$f":"Scoring!Y4","v":""}]
[null,{"$f":"Scoring!B5","v":"Safety"},{"$f":"IF(COUNTBLANK(B5)=0,VLOOKUP(B5,'MCA criteria weighting'!$D$7:$M$12,10,FALSE),\"\")","v":0.16666666666666666},{"$f":"Scoring!C5","v":"Ability to evacuate to safer locations or evacuation centres"},{"$f":"IF(B5=\"\",\"\",VLOOKUP(D5,'MCA indicator weighting'!D31:S42,16,FALSE))","v":0.33333333333333331},{"$f":"E5*C5","v":5.5555555555555552E-2},{"$f":"IF($B5=\"\",\"\",IF(G$4=\"\",\"\",AVERAGEIF(Scoring!$C$5:$C$37,$D5,Scoring!E$5:E$30)*$E5*$C5))","v":0.16666666666666666},{"$f":"IF($B5=\"\",\"\",IF(H$4=\"\",\"\",AVERAGEIF(Scoring!$C$5:$C$37,$D5,Scoring!F$5:F$30)*$E5*$C5))","v":""},{"$f":"IF($B5=\"\",\"\",IF(I$4=\"\",\"\",AVERAGEIF(Scoring!$C$5:$C$37,$D5,Scoring!G$5:G$30)*$E5*$C5))","v":""},{"$f":"IF($B5=\"\",\"\",IF(J$4=\"\",\"\",AVERAGEIF(Scoring!$C$5:$C$37,$D5,Scoring!H$5:H$30)*$E5*$C5))","v":""},{"$f":"IF($B5=\"\",\"\",IF(K$4=\"\",\"\",AVERAGEIF(Scoring!$C$5:$C$37,$D5,Scoring!I$5:I$30)*$E5*$C5))","v":""},{"$f":"IF($B5=\"\",\"\",IF(L$4=\"\",\"\",AVERAGEIF(Scoring!$C$5:$C$37,$D5,Scoring!J$5:J$30)*$E5*$C5))","v":""},{"$f":"IF($B5=\"\",\"\",IF(M$4=\"\",\"\",AVERAGEIF(Scoring!$C$5:$C$37,$D5,Scoring!K$5:K$30)*$E5*$C5))","v":""},{"$f":"IF($B5=\"\",\"\",IF(N$4=\"\",\"\",AVERAGEIF(Scoring!$C$5:$C$37,$D5,Scoring!L$5:L$30)*$E5*$C5))","v":""},{"$f":"IF($B5=\"\",\"\",IF(O$4=\"\",\"\",AVERAGEIF(Scoring!$C$5:$C$37,$D5,Scoring!M$5:M$30)*$E5*$C5))","v":""},{"$f":"IF($B5=\"\",\"\",IF(P$4=\"\",\"\",AVERAGEIF(Scoring!$C$5:$C$37,$D5,Scoring!N$5:N$30)*$E5*$C5))","v":""},{"$f":"IF($B5=\"\",\"\",IF(Q$4=\"\",\"\",AVERAGEIF(Scoring!$C$5:$C$37,$D5,Scoring!O$5:O$30)*$E5*$C5))","v":""},{"$f":"IF($B5=\"\",\"\",IF(R$4=\"\",\"\",AVERAGEIF(Scoring!$C$5:$C$37,$D5,Scoring!P$5:P$30)*$E5*$C5))","v":""},{"$f":"IF($B5=\"\",\"\",IF(S$4=\"\",\"\",AVERAGEIF(Scoring!$C$5:$C$37,$D5,Scoring!Q$5:Q$30)*$E5*$C5))","v":""},{"$f":"IF($B5=\"\",\"\",IF(T$4=\"\",\"\",AVERAGEIF(Scoring!$C$5:$C$37,$D5,Scoring!R$5:R$30)*$E5*$C5))","v":""},{"$f":"IF($B5=\"\",\"\",IF(U$4=\"\",\"\",AVERAGEIF(Scoring!$C$5:$C$37,$D5,Scoring!S$5:S$30)*$E5*$C5))","v":""},{"$f":"IF($B5=\"\",\"\",IF(V$4=\"\",\"\",AVERAGEIF(Scoring!$C$5:$C$37,$D5,Scoring!T$5:T$30)*$E5*$C5))","v":""},{"$f":"IF($B5=\"\",\"\",IF(W$4=\"\",\"\",AVERAGEIF(Scoring!$C$5:$C$37,$D5,Scoring!U$5:U$30)*$E5*$C5))","v":""},{"$f":"IF($B5=\"\",\"\",IF(X$4=\"\",\"\",AVERAGEIF(Scoring!$C$5:$C$37,$D5,Scoring!V$5:V$30)*$E5*$C5))","v":""},{"$f":"IF($B5=\"\",\"\",IF(Y$4=\"\",\"\",AVERAGEIF(Scoring!$C$5:$C$37,$D5,Scoring!W$5:W$30)*$E5*$C5))","v":""},{"$f":"IF($B5=\"\",\"\",IF(Z$4=\"\",\"\",AVERAGEIF(Scoring!$C$5:$C$37,$D5,Scoring!X$5:X$30)*$E5*$C5))","v":""},{"$f":"IF($B5=\"\",\"\",IF(AA$4=\"\",\"\",AVERAGEIF(Scoring!$C$5:$C$37,$D5,Scoring!Y$5:Y$30)*$E5*$C5))","v":""}]
[null,{"$f":"Scoring!B6","v":"Safety"},{"$f":"IF(COUNTBLANK(B6)=0,VLOOKUP(B6,'MCA criteria weighting'!$D$7:$M$12,10,FALSE),\"\")","v":0.16666666666666666},{"$f":"Scoring!C6","v":"Population at risk"},{"$f":"IF(B6=\"\",\"\",VLOOKUP(D6,'MCA indicator weighting'!D32:S43,16,FALSE))","v":0.33333333333333331},{"$f":"E6*C6","v":5.5555555555555552E-2},{"$f":"IF($B6=\"\",\"\",IF(G$4=\"\",\"\",AVERAGEIF(Scoring!$C$5:$C$37,$D6,Scoring!E$5:E$30)*$E6*$C6))","v":0.16666666666666666},{"$f":"IF($B6=\"\",\"\",IF(H$4=\"\",\"\",AVERAGEIF(Scoring!$C$5:$C$37,$D6,Scoring!F$5:F$30)*$E6*$C6))","v":""},{"$f":"IF($B6=\"\",\"\",IF(I$4=\"\",\"\",AVERAGEIF(Scoring!$C$5:$C$37,$D6,Scoring!G$5:G$30)*$E6*$C6))","v":""},{"$f":"IF($B6=\"\",\"\",IF(J$4=\"\",\"\",AVERAGEIF(Scoring!$C$5:$C$37,$D6,Scoring!H$5:H$30)*$E6*$C6))","v":""},{"$f":"IF($B6=\"\",\"\",IF(K$4=\"\",\"\",AVERAGEIF(Scoring!$C$5:$C$37,$D6,Scoring!I$5:I$30)*$E6*$C6))","v":""},{"$f":"IF($B6=\"\",\"\",IF(L$4=\"\",\"\",AVERAGEIF(Scoring!$C$5:$C$37,$D6,Scoring!J$5:J$30)*$E6*$C6))","v":""},{"$f":"IF($B6=\"\",\"\",IF(M$4=\"\",\"\",AVERAGEIF(Scoring!$C$5:$C$37,$D6,Scoring!K$5:K$30)*$E6*$C6))","v":""},{"$f":"IF($B6=\"\",\"\",IF(N$4=\"\",\"\",AVERAGEIF(Scoring!$C$5:$C$37,$D6,Scoring!L$5:L$30)*$E6*$C6))","v":""},{"$f":"IF($B6=\"\",\"\",IF(O$4=\"\",\"\",AVERAGEIF(Scoring!$C$5:$C$37,$D6,Scoring!M$5:M$30)*$E6*$C6))","v":""},{"$f":"IF($B6=\"\",\"\",IF(P$4=\"\",\"\",AVERAGEIF(Scoring!$C$5:$C$37,$D6,Scoring!N$5:N$30)*$E6*$C6))","v":""},{"$f":"IF($B6=\"\",\"\",IF(Q$4=\"\",\"\",AVERAGEIF(Scoring!$C$5:$C$37,$D6,Scoring!O$5:O$30)*$E6*$C6))","v":""},{"$f":"IF($B6=\"\",\"\",IF(R$4=\"\",\"\",AVERAGEIF(Scoring!$C$5:$C$37,$D6,Scoring!P$5:P$30)*$E6*$C6))","v":""},{"$f":"IF($B6=\"\",\"\",IF(S$4=\"\",\"\",AVERAGEIF(Scoring!$C$5:$C$37,$D6,Scoring!Q$5:Q$30)*$E6*$C6))","v":""},{"$f":"IF($B6=\"\",\"\",IF(T$4=\"\",\"\",AVERAGEIF(Scoring!$C$5:$C$37,$D6,Scoring!R$5:R$30)*$E6*$C6))","v":""},{"$f":"IF($B6=\"\",\"\",IF(U$4=\"\",\"\",AVERAGEIF(Scoring!$C$5:$C$37,$D6,Scoring!S$5:S$30)*$E6*$C6))","v":""},{"$f":"IF($B6=\"\",\"\",IF(V$4=\"\",\"\",AVERAGEIF(Scoring!$C$5:$C$37,$D6,Scoring!T$5:T$30)*$E6*$C6))","v":""},{"$f":"IF($B6=\"\",\"\",IF(W$4=\"\",\"\",AVERAGEIF(Scoring!$C$5:$C$37,$D6,Scoring!U$5:U$30)*$E6*$C6))","v":""},{"$f":"IF($B6=\"\",\"\",IF(X$4=\"\",\"\",AVERAGEIF(Scoring!$C$5:$C$37,$D6,Scoring!V$5:V$30)*$E6*$C6))","v":""},{"$f":"IF($B6=\"\",\"\",IF(Y$4=\"\",\"\",AVERAGEIF(Scoring!$C$5:$C$37,$D6,Scoring!W$5:W$30)*$E6*$C6))","v":""},{"$f":"IF($B6=\"\",\"\",IF(Z$4=\"\",\"\",AVERAGEIF(Scoring!$C$5:$C$37,$D6,Scoring!X$5:X$30)*$E6*$C6))","v":""},{"$f":"IF($B6=\"\",\"\",IF(AA$4=\"\",\"\",AVERAGEIF(Scoring!$C$5:$C$37,$D6,Scoring!Y$5:Y$30)*$E6*$C6))","v":""}]
{"$rows_left_out":26}
{"sheet":"Sensitivity","index":10,"n_rows":33,"n_cols":8,"rows_kept":33,"cut":false,"hidden":false,"merged":[[31,1,31,2],[32,1,32,2],[25,1,25,2],[26,1,26,2],[27,1,27,2],[28,1,28,2],[29,1,29,2],[21,1,21,2],[22,1,22,2],[23,1,23,2],[24,1,24,2],[30,1,30,2],[19,1,19,2],[14,1,14,2],[15,1,15,2],[16,1,16,2],[20,1,20,2],[12,1,12,2],[13,1,13,2],[1,1,1,5],[17,1,17,2],[18,1,18,2],[3,2,3,4],[4,4,10,4]]}
[]
[null,"Sensitivity Testing\nConduct sensitivity testing by adjusting the weightings of the assessment criteria to determine the impact on the results. \n\nTo ensure apprioriate sensitivity results are calculated, the sum of the criteria weightings must equal 100%. \n"]
[]
[null,"Criteria","Weighting"]
[null,"Safety",null,{"$f":"C5/3","v":0},{"$f":"IF($C$11=100%,\"\",\"Criteria weighting does not total 100%\")","v":"Criteria weighting does not total 100%"}]
[null,"Economic",null,{"$f":"C6/2","v":0}]
{"$rows_left_out":28}
{"sheet":"Sensitivity Calc","index":11,"n_rows":31,"n_cols":25,"rows_kept":31,"cut":false,"hidden":true,"merged":[]}
[]
[]
[null,null,null,null,null,{"$f":"TRANSPOSE('Multi-criteria assessment'!$E$7:$E$26)","v":""},"","","","","","","","","","","","","","","","","","",""]
[null,"Criteria","Targeted Indicator","Pairwise Comparison","Base Case",{"$f":"IF(F3=0,\"\",F3)","v":""},{"$f":"IF(G3=0,\"\",G3)","v":""},"","","","","","","","","","","","","","","","","",""]
[null,{"$f":"'Targeted indicators'!B9","v":"Safety"},{"$f":"'Targeted indicators'!C9","v":"Ability to evacuate to safer locations or evacuation centres"},{"$f":"IF(B5=\"\",\"\",VLOOKUP(B5,'MCA criteria weighting'!$D$7:$M$36,10,FALSE))","v":0.16666666666666666},3,{"$f":"Scoring!F$5*Sensitivity!$D$5","v":0},{"$f":"Scoring!G$5*Sensitivity!$D$5","v":0},{"$f":"Scoring!H$5*Sensitivity!$D$5","v":0},{"$f":"Scoring!I$5*Sensitivity!$D$5","v":0},{"$f":"Scoring!J$5*Sensitivity!$D$5","v":0},{"$f":"Scoring!K$5*Sensitivity!$D$5","v":0},{"$f":"Scoring!L$5*Sensitivity!$D$5","v":0},{"$f":"Scoring!M$5*Sensitivity!$D$5","v":0},{"$f":"Scoring!N$5*Sensitivity!$D$5","v":0},{"$f":"Scoring!O$5*Sensitivity!$D$5","v":0},{"$f":"Scoring!P$5*Sensitivity!$D$5","v":0},{"$f":"Scoring!Q$5*Sensitivity!$D$5","v":0},{"$f":"Scoring!R$5*Sensitivity!$D$5","v":0},{"$f":"Scoring!S$5*Sensitivity!$D$5","v":0},{"$f":"Scoring!T$5*Sensitivity!$D$5","v":0},{"$f":"Scoring!U$5*Sensitivity!$D$5","v":0},{"$f":"Scoring!V$5*Sensitivity!$D$5","v":0},{"$f":"Scoring!W$5*Sensitivity!$D$5","v":0},{"$f":"Scoring!X$5*Sensitivity!$D$5","v":0},{"$f":"Scoring!Y$5*Sensitivity!$D$5","v":0}]
[null,{"$f":"'Targeted indicators'!B10","v":"Safety"},{"$f":"'Targeted indicators'!C10","v":"Population at risk"},{"$f":"IF(B6=\"\",\"\",VLOOKUP(B6,'MCA criteria weighting'!$D$7:$M$36,10,FALSE))","v":0.16666666666666666},3,{"$f":"Scoring!F$6*Sensitivity!$D$5","v":0},{"$f":"Scoring!G$6*Sensitivity!$D$5","v":0},{"$f":"Scoring!H$6*Sensitivity!$D$5","v":0},{"$f":"Scoring!I$6*Sensitivity!$D$5","v":0},{"$f":"Scoring!J$6*Sensitivity!$D$5","v":0},{"$f":"Scoring!K$6*Sensitivity!$D$5","v":0},{"$f":"Scoring!L$6*Sensitivity!$D$5","v":0},{"$f":"Scoring!M$6*Sensitivity!$D$5","v":0},{"$f":"Scoring!N$6*Sensitivity!$D$5","v":0},{"$f":"Scoring!O$6*Sensitivity!$D$5","v":0},{"$f":"Scoring!P$6*Sensitivity!$D$5","v":0},{"$f":"Scoring!Q$6*Sensitivity!$D$5","v":0},{"$f":"Scoring!R$6*Sensitivity!$D$5","v":0},{"$f":"Scoring!S$6*Sensitivity!$D$5","v":0},{"$f":"Scoring!T$6*Sensitivity!$D$5","v":0},{"$f":"Scoring!U$6*Sensitivity!$D$5","v":0},{"$f":"Scoring!V$6*Sensitivity!$D$5","v":0},{"$f":"Scoring!W$6*Sensitivity!$D$5","v":0},{"$f":"Scoring!X$6*Sensitivity!$D$5","v":0},{"$f":"Scoring!Y$6*Sensitivity!$D$5","v":0}]
{"$rows_left_out":26}
{"sheet":"General Calc","index":12,"n_rows":51,"n_cols":19,"rows_kept":51,"cut":false,"hidden":true,"merged":[]}
["General Calculations and Lists"]
[]
[]
[null,"Pairwise List","Yes/ No List","Grading List","Grading List",null,"Weighting Summary Table",null,null,"Criterion","Pairwise Comparison","Adjusted Weighting",null,null,null,"Difference in Weighting"]
[null,"A","Yes","Indicator Met","Cost is practical",null,"Criterion","Pairwise Comparison",null,null,null,-0.5,-0.25,0.25,0.5,-0.5,-0.25,0.25,0.5]
[null,"B","No","Not met","Cost is not practical",null,{"$f":"IF(INDEX('MCA criteria weighting'!$D$7:$D$12,ROWS($G$6:$G6))=0,\"\",INDEX('MCA criteria weighting'!$D$7:$D$12,ROWS($G$6:$G6)))","v":"Safety"},{"$f":"IF($G6=\"\",\"\",INDEX('MCA criteria weighting'!$M$7:$M$12,MATCH($G6,'MCA criteria weighting'!$D$7:$D$12,0)))","v":0.16666666666666666},null,{"$f":"IF(INDEX('MCA criteria weighting'!$D$7:$D$12,ROWS($J$6:$J6))=0,\"\",INDEX('MCA criteria weighting'!$D$7:$D$12,ROWS($J$6:$J6)))","v":"Safety"},{"$f":"IF($J6=\"\",\"\",INDEX($H$6:$H$25,MATCH($G28,$G$6:$G$25,0),MATCH($K$4,$H$5:$H$5,0)))","v":0.16666666666666666},{"$f":"IF($J6=\"\",\"\",$K6*(1+L$5))","v":8.3333333333333329E-2},0.125,0.20833333333333331,0.25,{"$f":"IF($J6=\"\",\"\",L6-$K6)","v":-8.3333333333333329E-2},{"$f":"IF($J6=\"\",\"\",M6-$K6)","v":-4.1666666666666657E-2},4.1666666666666657E-2,8.3333333333333343E-2]
{"$rows_left_out":45}